Merge branch 'bugfix' into 'develop'

Bugfix

See merge request west-devel/West!27
9 jobs for v4.2.1 in 5 minutes and 48 seconds (queued for 23 minutes and 30 seconds)
latest
Status Job ID Name Coverage
  Build
failed #10124
node-01 docker rcc
gcc650_0001

00:00:55

failed #10125
node-01 docker rcc
gcc650_0002

00:00:56

failed #10126
node-01 docker rcc
gcc740_0001

00:00:55

failed #10127
node-01 docker rcc
gcc740_0002

00:00:55

failed #10128
node-01 docker rcc
gcc830_0001

00:01:02

failed #10129
node-01 docker rcc
gcc830_0002

00:01:01

 
  Test
skipped #10130
node-01 docker rcc
gcc830_0001_t
skipped #10131
node-01 docker rcc
gcc830_0002_t
 
  Doc
skipped #10132
node-01 docker rcc
west_doc_build
 
Name Stage Failure
failed
gcc830_0002 Build
/bin/sh: 1: --cflags: not found
/bin/sh: 1: --ldflags: not found
/bin/sh: 1: --extension-suffix: not found
/bin/sh: 1: --help: not found
/bin/sh: 1: --abiflags: not found
/bin/sh: 1: --configdir: not found
Makefile:25: recipe for target 'conf' failed
make: *** [conf] Error 127
ERROR: Job failed: exit code 1
failed
gcc830_0001 Build
/bin/sh: 1: --cflags: not found
/bin/sh: 1: --ldflags: not found
/bin/sh: 1: --extension-suffix: not found
/bin/sh: 1: --help: not found
/bin/sh: 1: --abiflags: not found
/bin/sh: 1: --configdir: not found
Makefile:25: recipe for target 'conf' failed
make: *** [conf] Error 127
ERROR: Job failed: exit code 1
failed
gcc740_0002 Build
/bin/sh: 1: --cflags: not found
/bin/sh: 1: --ldflags: not found
/bin/sh: 1: --extension-suffix: not found
/bin/sh: 1: --help: not found
/bin/sh: 1: --abiflags: not found
/bin/sh: 1: --configdir: not found
Makefile:25: recipe for target 'conf' failed
make: *** [conf] Error 127
ERROR: Job failed: exit code 1
failed
gcc740_0001 Build
/bin/sh: 1: --libs: not found
/bin/sh: 1: --ldflags: not found
/bin/sh: 1: --extension-suffix: not found
/bin/sh: 1: --help: not found
/bin/sh: 1: --abiflags: not found
/bin/sh: 1: --configdir: not found
Makefile:25: recipe for target 'conf' failed
make: *** [conf] Error 127
ERROR: Job failed: exit code 1
failed
gcc650_0002 Build
/bin/sh: 1: --cflags: not found
/bin/sh: 1: --ldflags: not found
/bin/sh: 1: --extension-suffix: not found
/bin/sh: 1: --help: not found
/bin/sh: 1: --abiflags: not found
/bin/sh: 1: --configdir: not found
make: *** [conf] Error 127
Makefile:25: recipe for target 'conf' failed
ERROR: Job failed: exit code 1
failed
gcc650_0001 Build
/bin/sh: 1: --cflags: not found
/bin/sh: 1: --ldflags: not found
/bin/sh: 1: /bin/sh: 1: --extension-suffix: not found
--help: not found
/bin/sh: 1: --abiflags: not found
/bin/sh: 1: --configdir: not found
make: *** [conf] Error 127
Makefile:25: recipe for target 'conf' failed
ERROR: Job failed: exit code 1