9 jobs for master in 5 minutes and 50 seconds (queued for 17 minutes and 44 seconds)
Status Job ID Name Coverage
  Build
failed #10115
node-01 docker rcc
gcc650_0001

00:00:56

failed #10116
node-01 docker rcc
gcc650_0002

00:00:57

failed #10117
node-01 docker rcc
gcc740_0001

00:00:55

failed #10118
node-01 docker rcc
gcc740_0002

00:00:56

failed #10119
node-01 docker rcc
gcc830_0001

00:01:01

failed #10120
node-01 docker rcc
gcc830_0002

00:01:02

 
  Test
skipped #10121
node-01 docker rcc
gcc830_0001_t
skipped #10122
node-01 docker rcc
gcc830_0002_t
 
  Doc
skipped #10123
node-01 docker rcc
west_doc_build
 
Name Stage Failure
failed
gcc830_0002 Build

/bin/sh: 1: --ldflags: not found
/bin/sh: 1: --extension-suffix: not found
/bin/sh: 1: --help: not found
/bin/sh: 1: --abiflags: not found
/bin/sh: 1: --configdir: not found
make: *** [conf] Error 127
Makefile:25: recipe for target 'conf' failed
ERROR: Job failed: exit code 1
failed
gcc830_0001 Build
--cflags: not found
/bin/sh: 1: --ldflags: not found
/bin/sh: 1: --extension-suffix: not found
/bin/sh: 1: --help: not found
/bin/sh: 1: --abiflags: not found
/bin/sh: 1: --configdir: not found
Makefile:25: recipe for target 'conf' failed
make: *** [conf] Error 127
ERROR: Job failed: exit code 1
failed
gcc740_0002 Build
/bin/sh: 1: --cflags: not found
/bin/sh: 1: --ldflags: not found
/bin/sh: 1: --extension-suffix: not found
/bin/sh: 1: --help: not found
/bin/sh: 1: --abiflags: not found
/bin/sh: 1: --configdir: not found
Makefile:25: recipe for target 'conf' failed
make: *** [conf] Error 127
ERROR: Job failed: exit code 1
failed
gcc740_0001 Build
/bin/sh: 1: --cflags: not found
/bin/sh: 1: --ldflags: not found
/bin/sh: 1: --extension-suffix: not found
/bin/sh: 1: --help: not found
/bin/sh: 1: --configdir: not found
/bin/sh: 1: --abiflags: not found
make: *** [conf] Error 127
Makefile:25: recipe for target 'conf' failed
ERROR: Job failed: exit code 1
failed
gcc650_0002 Build
/bin/sh: 1: --cflags: not found
/bin/sh: 1: --ldflags: not found
/bin/sh: 1: --extension-suffix: not found
/bin/sh: 1: --help: not found
/bin/sh: 1: --abiflags: not found
/bin/sh: 1: --configdir: not found
Makefile:25: recipe for target 'conf' failed
make: *** [conf] Error 127
ERROR: Job failed: exit code 1
failed
gcc650_0001 Build
/bin/sh: 1: --cflags: not found
/bin/sh: 1: --ldflags: not found
/bin/sh: 1: --extension-suffix: not found
/bin/sh: 1: --help: not found
/bin/sh: 1: --abiflags: not found
/bin/sh: 1: --configdir: not found
Makefile:25: recipe for target 'conf' failed
make: *** [conf] Error 127
ERROR: Job failed: exit code 1