Merge branch 'bugfix' into 'develop'

Bugfix

See merge request west-devel/West!27
9 jobs for v4.2.1 in 5 minutes and 48 seconds (queued for 23 minutes and 30 seconds)
latest
Status Name Job ID Coverage
  Build
failed gcc650_0001 #10124
rcc docker node-01

00:00:55

failed gcc650_0002 #10125
rcc docker node-01

00:00:56

failed gcc740_0001 #10126
rcc docker node-01

00:00:55

failed gcc740_0002 #10127
rcc docker node-01

00:00:55

failed gcc830_0001 #10128
rcc docker node-01

00:01:02

failed gcc830_0002 #10129
rcc docker node-01

00:01:01

 
  Test
skipped gcc830_0001_t #10130
rcc docker node-01
skipped gcc830_0002_t #10131
rcc docker node-01
 
  Doc
skipped west_doc_build #10132
docker node-01 rcc
 
Name Stage Failure
failed
gcc830_0001 Build
/bin/sh: 1: --cflags: not found
/bin/sh: 1: --ldflags: not found
/bin/sh: 1: --extension-suffix: not found
/bin/sh: 1: --help: not found
/bin/sh: 1: --abiflags: not found
/bin/sh: 1: --configdir: not found
Makefile:25: recipe for target 'conf' failed
make: *** [conf] Error 127
ERROR: Job failed: exit code 1
failed
gcc740_0002 Build
/bin/sh: 1: --cflags: not found
/bin/sh: 1: --ldflags: not found
/bin/sh: 1: --extension-suffix: not found
/bin/sh: 1: --help: not found
/bin/sh: 1: --abiflags: not found
/bin/sh: 1: --configdir: not found
Makefile:25: recipe for target 'conf' failed
make: *** [conf] Error 127
ERROR: Job failed: exit code 1
failed
gcc650_0002 Build
/bin/sh: 1: --cflags: not found
/bin/sh: 1: --ldflags: not found
/bin/sh: 1: --extension-suffix: not found
/bin/sh: 1: --help: not found
/bin/sh: 1: --abiflags: not found
/bin/sh: 1: --configdir: not found
make: *** [conf] Error 127
Makefile:25: recipe for target 'conf' failed
ERROR: Job failed: exit code 1
failed
gcc650_0001 Build
/bin/sh: 1: --cflags: not found
/bin/sh: 1: --ldflags: not found
/bin/sh: 1: /bin/sh: 1: --extension-suffix: not found
--help: not found
/bin/sh: 1: --abiflags: not found
/bin/sh: 1: --configdir: not found
make: *** [conf] Error 127
Makefile:25: recipe for target 'conf' failed
ERROR: Job failed: exit code 1
failed
gcc740_0001 Build
/bin/sh: 1: --libs: not found
/bin/sh: 1: --ldflags: not found
/bin/sh: 1: --extension-suffix: not found
/bin/sh: 1: --help: not found
/bin/sh: 1: --abiflags: not found
/bin/sh: 1: --configdir: not found
Makefile:25: recipe for target 'conf' failed
make: *** [conf] Error 127
ERROR: Job failed: exit code 1
failed
gcc830_0002 Build
/bin/sh: 1: --cflags: not found
/bin/sh: 1: --ldflags: not found
/bin/sh: 1: --extension-suffix: not found
/bin/sh: 1: --help: not found
/bin/sh: 1: --abiflags: not found
/bin/sh: 1: --configdir: not found
Makefile:25: recipe for target 'conf' failed
make: *** [conf] Error 127
ERROR: Job failed: exit code 1