9 jobs for master in 5 minutes and 50 seconds (queued for 17 minutes and 44 seconds)
Status Name Job ID Coverage
  Build
failed gcc650_0001 #10115
rcc docker node-01

00:00:56

failed gcc650_0002 #10116
rcc docker node-01

00:00:57

failed gcc740_0001 #10117
rcc docker node-01

00:00:55

failed gcc740_0002 #10118
rcc docker node-01

00:00:56

failed gcc830_0001 #10119
rcc docker node-01

00:01:01

failed gcc830_0002 #10120
rcc docker node-01

00:01:02

 
  Test
skipped gcc830_0001_t #10121
rcc docker node-01
skipped gcc830_0002_t #10122
rcc docker node-01
 
  Doc
skipped west_doc_build #10123
rcc docker node-01
 
Name Stage Failure
failed
gcc830_0002 Build

/bin/sh: 1: --ldflags: not found
/bin/sh: 1: --extension-suffix: not found
/bin/sh: 1: --help: not found
/bin/sh: 1: --abiflags: not found
/bin/sh: 1: --configdir: not found
make: *** [conf] Error 127
Makefile:25: recipe for target 'conf' failed
ERROR: Job failed: exit code 1
failed
gcc650_0001 Build
/bin/sh: 1: --cflags: not found
/bin/sh: 1: --ldflags: not found
/bin/sh: 1: --extension-suffix: not found
/bin/sh: 1: --help: not found
/bin/sh: 1: --abiflags: not found
/bin/sh: 1: --configdir: not found
Makefile:25: recipe for target 'conf' failed
make: *** [conf] Error 127
ERROR: Job failed: exit code 1
failed
gcc830_0001 Build
--cflags: not found
/bin/sh: 1: --ldflags: not found
/bin/sh: 1: --extension-suffix: not found
/bin/sh: 1: --help: not found
/bin/sh: 1: --abiflags: not found
/bin/sh: 1: --configdir: not found
Makefile:25: recipe for target 'conf' failed
make: *** [conf] Error 127
ERROR: Job failed: exit code 1
failed
gcc650_0002 Build
/bin/sh: 1: --cflags: not found
/bin/sh: 1: --ldflags: not found
/bin/sh: 1: --extension-suffix: not found
/bin/sh: 1: --help: not found
/bin/sh: 1: --abiflags: not found
/bin/sh: 1: --configdir: not found
Makefile:25: recipe for target 'conf' failed
make: *** [conf] Error 127
ERROR: Job failed: exit code 1
failed
gcc740_0001 Build
/bin/sh: 1: --cflags: not found
/bin/sh: 1: --ldflags: not found
/bin/sh: 1: --extension-suffix: not found
/bin/sh: 1: --help: not found
/bin/sh: 1: --configdir: not found
/bin/sh: 1: --abiflags: not found
make: *** [conf] Error 127
Makefile:25: recipe for target 'conf' failed
ERROR: Job failed: exit code 1
failed
gcc740_0002 Build
/bin/sh: 1: --cflags: not found
/bin/sh: 1: --ldflags: not found
/bin/sh: 1: --extension-suffix: not found
/bin/sh: 1: --help: not found
/bin/sh: 1: --abiflags: not found
/bin/sh: 1: --configdir: not found
Makefile:25: recipe for target 'conf' failed
make: *** [conf] Error 127
ERROR: Job failed: exit code 1